Attempts with transports and coercions

4 jobs for oak-typable in 4 minutes and 22 seconds (queued for 1 second)
latest
Status Job ID Name Coverage
  Build
failed #72901
au
coq:8.7

00:01:31

failed #72902
au
coq:8.8

00:01:39

failed #72903
au
coq:8.9

00:01:34

failed #72904
au
coq:dev

00:02:40

 
Name Stage Failure
failed
coq:dev Build
CoqMakefile:654: recipe for target 'src/Oak.vo' failed
make[2]: *** [src/Oak.vo] Error 1
make[2]: *** Waiting for unfinished jobs....
CoqMakefile:319: recipe for target 'all' failed
make[1]: Leaving directory '/builds/jakobbotsch/smart-contracts'
make[1]: *** [all] Error 2
Makefile:7: recipe for target 'all' failed
make: *** [all] Error 2
ERROR: Job failed: exit code 1
failed
coq:8.9 Build
CoqMakefile:662: recipe for target 'src/Oak.vo' failed
make[2]: *** [src/Oak.vo] Error 1
make[2]: *** Waiting for unfinished jobs....
CoqMakefile:326: recipe for target 'all' failed
make[1]: Leaving directory '/builds/jakobbotsch/smart-contracts'
Makefile:7: recipe for target 'all' failed
make[1]: *** [all] Error 2
make: *** [all] Error 2
ERROR: Job failed: exit code 1
failed
coq:8.8 Build
CoqMakefile:656: recipe for target 'src/Oak.vo' failed
make[2]: *** [src/Oak.vo] Error 1
make[2]: *** Waiting for unfinished jobs....
CoqMakefile:317: recipe for target 'all' failed
make[1]: Leaving directory '/builds/jakobbotsch/smart-contracts'
Makefile:7: recipe for target 'all' failed
make[1]: *** [all] Error 2
make: *** [all] Error 2
ERROR: Job failed: exit code 1
failed
coq:8.7 Build
CoqMakefile:645: recipe for target 'src/Oak.vo' failed
make[2]: *** [src/Oak.vo] Error 1
make[2]: *** Waiting for unfinished jobs....
make[1]: *** [all] Error 2
CoqMakefile:318: recipe for target 'all' failed
make[1]: Leaving directory '/builds/jakobbotsch/smart-contracts'
Makefile:7: recipe for target 'all' failed
make: *** [all] Error 2
ERROR: Job failed: exit code 1