Merge branch 'master' of https://gitlab.au.dk/cfp/air

1 job for master in 4 minutes and 11 seconds (queued for 3 seconds)
Name Stage Failure
failed
test Test
-- Docs: https://docs.pytest.org/en/stable/warnings.html
=========================== short test summary info ============================
FAILED ml/tests/test_data_loader.py::test_complete_loader - AttributeError: '...
FAILED ml/tests/test_data_loader.py::test_compliance_loader - AttributeError:...
FAILED ml/tests/test_data_loader.py::test_fall_loader - AttributeError: 'nump...
FAILED ml/tests/test_data_loader.py::test_risk_loader - AttributeError: 'nump...
================== 4 failed, 67 passed, 7 warnings in 47.68s ===================
Cleaning up project directory and file based variables
ERROR: Job failed: exit code 1